{"text_format":"1","workbook":"xlsx","n_sheets":7,"sheets":["numbers","audit1","audit2","audit3","audit4","comparisons","trends"],"not_rendered":{"charts":180,"images":0,"macros":0,"external_links":0,"defined_names":53,"comments":0,"pivot_tables":0},"unopened":[],"bounds":{"document_bytes":16777216,"sheet_cells":100000,"rows_first":2000,"rows_last":500,"rows_between":2000,"halvings":0,"cell_chars":16384,"cell_head_chars":4096},"cells_cut":0,"cells_raw":0,"read":"whole","date_system":"1900"}

{"sheet":"numbers","index":0,"n_rows":232,"n_cols":5,"rows_kept":232,"cut":false,"hidden":false,"merged":[[199,0,199,4],[8,0,8,4],[9,0,9,4],[3,0,3,4],[5,0,5,4],[6,0,6,4],[4,0,4,4]]}
[]
["Health Status of Patients with Diabetes"]
[]
["Use this spreadsheet to generate charts from the IHS Diabetes Audit. When you enter percentages in the columns below, the charts on the corresponding worksheets will automatically fill in. You can use the percentages on the Cumulative Audit report in the Diabetes Management System in RPMS, or use numbers from your annual IHS Diabetes Audit. This spreadsheet has columns for up to four reports. These might be time periods (years, quarters, etc.) or different groups (patients assigned to primary providers, IHS area-wide results, etc.). The final two sheets show all four columns together, with an emphasis either on different groupings or different time periods. You can move to different worksheets using the tabs at the bottom left corner of this screen."]
["Directions"]
["1.Items in the shaded cells are found in the Diabetes Audit.  Refer to either your annual Indian Health Service Diabetes Audit or generate the \"cumulative audit\" in the Diabetes Management System."]
["2. Enter corresponding PERCENTAGES (%) into the cells for each time frame."]
["3. Save a copy on your computer or network."]
["4. View and print your custom report by clicking on the tabs below.  "]
["5. Questions? Contact the Western Tribal Diabetes Program at 1-800-862-5497."]
[]
[null,"Audit 1","Audit 2","Audit 3","Audit 4"]
[null,"%","%","%","%"]
["HEADER INFORMATION"]
["Name (clinic, provider, etc.)","IHS Demo Site","IHS Demo Site","IHS Demo Site","IHS Demo Site"]
["Reporting period","1/1/2005-12/31/2005","1/1/2006-12/31/2006","1/1/2007-12/31/2007","1/1/2008-12/31/2008"]
["Number of patients in report",47,55,67,98]
["Additional description (optional)","Active patients on the IHS Diabetes Register","Active patients on the IHS Diabetes Register","Active patients on the IHS Diabetes Register","Active patients on the IHS Diabetes Register"]
[]
["Gender of Patients with Diabetes"]
["Female",36,39,42,48]
["Male",64,61,58,52]
[]
["Age of Patients with Diabetes"]
["<15 years",0,0,0,1]
["15-44 years",8,9,10,11]
["45-64 years",56,57,60,62]
["65 years and older",36,34,30,26]
[]
["Type of Diabetes Diagnosed"]
["Type 1",0,0,2,1]
["Type 2",100,100,98,99]
["Unknown",0,0,0,0]
[]
["Duration of Diabetes"]
["Less than 10 years",69,65,55,64]
["10 years or more",11,17,29,27]
["Diagnosis date not recorded",20,18,16,9]
[]
["Weight Control in Patients with Diabetes "]
["Normal (BMI < 25.0)",3,4,5,8]
["Overweight (BMI 25.0-25.9)",55,62,68,76]
["Obese (BMI 30.0 or above)",17,15,12,10]
["Height or Weight missing",25,19,15,6]
[]
["Blood Sugar Control"]
["HbA1c <7",17,22,35,43]
["HbA1c 7.0-7.9",12,16,14,12]
["HbA1c 8.0-8.9",10,10,9,8]
["HbA1c 9.0-9.9",8,10,8,8]
["HbA1c 10.0-10.9",6,5,4,5]
["HbA1c 11.0 or higher",5,4,3,2]
["Undocumented",42,33,27,22]
[]
["Blood Pressure Control"]
["Ideal BP Control (<120/<70)",9,20,26,29]
["Target (120/70 - <130/<80)",10,23,22,24]
["Adequate (130/80 - <140/<90)",39,29,25,22]
["Inadequate (140/90 - <160/<95)",25,17,17,17]
["Markedly Poor (160/95 or higher)",17,11,10,8]
["BP control undetermined",45,25,15,5]
[]
["Tobacco Use"]
["Current Tobacco User",14,20,25,30]
["Counseled - Yes",20,40,60,80]
["Counseled - No",80,60,40,20]
["Counseled - Refused",0,0,0,0]
["Not a current tobacco user",40,43,49,66]
["Tobacco use not documented",46,37,26,4]
[]
["Diabetes Therapy"]
["Diet and Exercise Alone",33,29,28,22]
["Insulin ",11,10,9,11]
["Sulfonylurea",14,13,8,5]
["Metformin",53,57,52,50]
["Acarbose/Miglitol",0,0,0,0]
["Glitazone",8,8,8,8]
["Incretin mimetics (Byetta)",6,6,6,6]
["DPP4 inhibitors (Januvia, Galvus)",0,0,0,0]
["Amylin analogues (Symlin)",19,23,18,16]
["Any Oral med combination",6,6,4,6]
["Any Insulin + other med combination",3,0,0,0]
["Unknown/refused",1]
[]
["Antiplatelet Therapy"]
["Aspirin/Antiplatelet Prescription",16,22,23,25]
["None",69,66,67,65]
["Refused or Adverse Reaction",15,12,10,10]
[]
["ACE Inhibitor (or ARB) Use"]
["Use in pts with overt proteinuria",45,47,46,48]
["Use in pts with known hypertension",22,26,28,23]
[]
["Lipid-Lowering Agent Use"]
["Use in pts with total chol ≥240",33,44,55,66]
["Use in pts with LDL chol > 100",29,29,29,29]
["Statin drug",10,55,52,45]
["Non-statin drug",20,15,13,15]
["Statin AND non-statin",70,30,35,40]
["Refused or Adverse Reaction"]
[]
["Yearly Foot, Eye, and Dental Exams"]
["Foot Exam - Neuro & Vasc",36,44,60,67]
["Eye Exam - Dilated",7,44,40,58]
["Dental Exam",50,56,80,42]
[]
["Immunizations"]
["Flu Vaccine - yearly",80,57,67,80]
["Pneumovax - once",40,36,56,60]
["Tetanus/Diphtheria (q 10 yrs)",47,36,33,60]
[]
["LABORATORY EXAMS"]
[]
["Urine Protein Testing during Audit Period"]
["Yes",65,22,22,22]
["No",30,36,36,36]
["Refused",5,22,22,22]
[]
["Type of urine protein testing"]
["Quantitative Alb:Creat Ratio",20,20,20,20]
["Semi-quantitative Alb:Creat Ratio",25,25,25,25]
["Protein:Creat Ratio",31,31,31,31]
["Other quantitative test",13,13,13,13]
["1+ protein or more on standard dipstick",6,6,6,6]
["Other non-quantitative test",5,5,5,5]
[]
["Results for patients tested with an A:C ratio or with 1+ protein or more on UA dipstick"]
["Normal urine albumin",95,0,0,0]
["Microalbuminuria",4,0,0,0]
["Overt proteinuria",1,0,0,17]
[]
["Blood Creatinine Obtained in Past 12 Months",78,66,75,79]
["Creatinine ≥2.0mg/dl",2,0,2,1]
["Creatinine < 2.0 mg/dl",76,66,73,78]
["Creatinine not tested/ Unknown",22,34,25,21]
[]
["Estimated GFR Documented during Audit Period",89,89,56,45]
[]
["Cholesterol Obtained in Past 12 Months",67,87,36,100]
["Desirable (<200 mg/dl)",50,60,14,89]
["Borderline (200-239 g/dl)",8,13,7,0]
["High (240 mg/dl or more)",8,13,14,11]
["Not tested",33,13,64,0]
[]
["LDL Obtained in Past 12 Months",67,73,21,89]
["LDL <100 mg/dl",42,47,14,89]
["LDL 100-129 mg/dl",8,7,7,0]
["LDL 130-160 mg/dl",8,0,0,0]
["LDL >160",34,26,79,11]
["Not tested",33,27,79,11]
[]
["HDL Obtained in Past 12 Months",67,87,36,89]
["HDL <35 mg/dl",17,20,7,44]
["HDL 35-45 mg/dl",8,20,21,11]
["HDL 46-55 mg/dl",33,27,7,33]
["HDL >55",34,13,65,12]
["Not tested",33,13,64,11]
[]
["Triglycerides Obtained in Past 12 Months",67,87,36,89]
["TG <150 mg/dl",17,13,7,0]
["TG 150-199 mg/dl",17,27,7,44]
["TG 200-400 mg/dl",0,13,14,11]
["TG >400 mg/dl",33,14,65,12]
["Not tested",33,13,64,11]
[]
["EKG (age 30 and above)"]
["Performed in past 3 years",36,56,50,42]
["Performed in past 5 years",29,33,20,33]
["Ever performed",36,44,40,33]
[]
["Tuberculosis Status"]
["PPD +, INH treatment complete",0,0,0,0]
["PPD +, untreated, incomplete, or tx unknown",0,7,7,0]
["PPD -, placed since DM dx",8,0,7,0]
["PPD -, placed before DM dx",25,13,0,0]
["PPD status unknown",67,73,86,100]
["PPD -, date of diagnosis or PPD date unknown",0,7,0,0]
["PPD refused",0,0,0,0]
[]
["Diabetes-Related Education (Yearly)"]
["Diet Instruction by any provider",50,56,80,42]
["Diet Instruction by RD",45,56,40,20]
["Exercise Instruction",7,33,90,58]
["Other Diabetes Education",7,56,70,67]
["Any of the listed topics",63,75,95,70]
[]
["Depression Identified as Active Diagnosis"]
["Yes",3,6,9,12]
["No",97,94,91,88]
[]
["Of the Patients without Active Depression Diagnosis, Proportion Screened for Depression in Past Year"]
["Screened",55,60,65,70]
["Not Screened",40,40,35,30]
["Refused Screening",5,0,0,0]
[]
["All"]
[]
[]
[]
["These chart titles feed into the charts on the sheets for Audit 1 - Audit 4. Darker shaded cells are for charts with different denominators than the overall number of patients in the audit report."]
[]
["Change title text in this column:","Audit 1","Audit 2","Audit 3","Audit 4"]
[{"$f":"A20","v":"Gender of Patients with Diabetes"},{"$f":"$A203&\" \n(n=\"&B$17&\" Patients)\"","v":"Gender of Patients with Diabetes \n(n=47 Patients)"},{"$f":"$A203&\" \n(n=\"&numbers!C$17&\" Patients)\"","v":"Gender of Patients with Diabetes \n(n=55 Patients)"},{"$f":"$A203&\" \n(n=\"&numbers!D$17&\" Patients)\"","v":"Gender of Patients with Diabetes \n(n=67 Patients)"},{"$f":"$A203&\" \n(n=\"&numbers!E$17&\" Patients)\"","v":"Gender of Patients with Diabetes \n(n=98 Patients)"}]
[{"$f":"A24","v":"Age of Patients with Diabetes"},{"$f":"$A204&\" \n(n=\"&numbers!B$17&\" Patients)\"","v":"Age of Patients with Diabetes \n(n=47 Patients)"},{"$f":"$A204&\" \n(n=\"&numbers!C$17&\" Patients)\"","v":"Age of Patients with Diabetes \n(n=55 Patients)"},{"$f":"$A204&\" \n(n=\"&numbers!D$17&\" Patients)\"","v":"Age of Patients with Diabetes \n(n=67 Patients)"},{"$f":"$A204&\" \n(n=\"&numbers!E$17&\" Patients)\"","v":"Age of Patients with Diabetes \n(n=98 Patients)"}]
[{"$f":"A30","v":"Type of Diabetes Diagnosed"},{"$f":"$A205&\" \n(n=\"&numbers!B$17&\" Patients)\"","v":"Type of Diabetes Diagnosed \n(n=47 Patients)"},{"$f":"$A205&\" \n(n=\"&numbers!C$17&\" Patients)\"","v":"Type of Diabetes Diagnosed \n(n=55 Patients)"},{"$f":"$A205&\" \n(n=\"&numbers!D$17&\" Patients)\"","v":"Type of Diabetes Diagnosed \n(n=67 Patients)"},{"$f":"$A205&\" \n(n=\"&numbers!E$17&\" Patients)\"","v":"Type of Diabetes Diagnosed \n(n=98 Patients)"}]
[{"$f":"A35","v":"Duration of Diabetes"},{"$f":"$A206&\" (n=\"&numbers!B$17&\" Patients)\"","v":"Duration of Diabetes (n=47 Patients)"},{"$f":"$A206&\" (n=\"&numbers!C$17&\" Patients)\"","v":"Duration of Diabetes (n=55 Patients)"},{"$f":"$A206&\" (n=\"&numbers!D$17&\" Patients)\"","v":"Duration of Diabetes (n=67 Patients)"},{"$f":"$A206&\" (n=\"&numbers!E$17&\" Patients)\"","v":"Duration of Diabetes (n=98 Patients)"}]
[{"$f":"A40","v":"Weight Control in Patients with Diabetes "},{"$f":"$A207&\" \n(n=\"&numbers!B$17&\" Patients)\"","v":"Weight Control in Patients with Diabetes  \n(n=47 Patients)"},{"$f":"$A207&\" \n(n=\"&numbers!C$17&\" Patients)\"","v":"Weight Control in Patients with Diabetes  \n(n=55 Patients)"},{"$f":"$A207&\" \n(n=\"&numbers!D$17&\" Patients)\"","v":"Weight Control in Patients with Diabetes  \n(n=67 Patients)"},{"$f":"$A207&\" \n(n=\"&numbers!E$17&\" Patients)\"","v":"Weight Control in Patients with Diabetes  \n(n=98 Patients)"}]
[{"$f":"A46","v":"Blood Sugar Control"},{"$f":"$A208&\" \n(n=\"&numbers!B$17&\" Patients)\"","v":"Blood Sugar Control \n(n=47 Patients)"},{"$f":"$A208&\" \n(n=\"&numbers!C$17&\" Patients)\"","v":"Blood Sugar Control \n(n=55 Patients)"},{"$f":"$A208&\" \n(n=\"&numbers!D$17&\" Patients)\"","v":"Blood Sugar Control \n(n=67 Patients)"},{"$f":"$A208&\" \n(n=\"&numbers!E$17&\" Patients)\"","v":"Blood Sugar Control \n(n=98 Patients)"}]
[{"$f":"A55","v":"Blood Pressure Control"},{"$f":"$A209&\" (n=\"&numbers!B$17&\" Patients)\"","v":"Blood Pressure Control (n=47 Patients)"},{"$f":"$A209&\" (n=\"&numbers!C$17&\" Patients)\"","v":"Blood Pressure Control (n=55 Patients)"},{"$f":"$A209&\" (n=\"&numbers!D$17&\" Patients)\"","v":"Blood Pressure Control (n=67 Patients)"},{"$f":"$A209&\" (n=\"&numbers!E$17&\" Patients)\"","v":"Blood Pressure Control (n=98 Patients)"}]
[{"$f":"A63","v":"Tobacco Use"},{"$f":"$A210&\" \n(n=\"&numbers!B$17&\" Patients)\"","v":"Tobacco Use \n(n=47 Patients)"},{"$f":"$A210&\" (n=\"&numbers!C$17&\" Patients)\"","v":"Tobacco Use (n=55 Patients)"},{"$f":"$A210&\" \n(n=\"&numbers!D$17&\" Patients)\"","v":"Tobacco Use \n(n=67 Patients)"},{"$f":"$A210&\" \n(n=\"&numbers!E$17&\" Patients)\"","v":"Tobacco Use \n(n=98 Patients)"}]
["Tobacco Cessation Counseling for Current Tobacco Users",{"$f":"$A211&\" \n(n=\"&(ROUND((B$17*B64/100),0))&\" Patients)\"","v":"Tobacco Cessation Counseling for Current Tobacco Users \n(n=7 Patients)"},{"$f":"$A211&\" \n(n=\"&(ROUND((C$17*C64/100),0))&\" Patients)\"","v":"Tobacco Cessation Counseling for Current Tobacco Users \n(n=11 Patients)"},{"$f":"$A211&\" \n(n=\"&(ROUND((D$17*D64/100),0))&\" Patients)\"","v":"Tobacco Cessation Counseling for Current Tobacco Users \n(n=17 Patients)"},{"$f":"$A211&\" \n(n=\"&(ROUND((E$17*E64/100),0))&\" Patients)\"","v":"Tobacco Cessation Counseling for Current Tobacco Users \n(n=29 Patients)"}]
[{"$f":"A71","v":"Diabetes Therapy"},{"$f":"$A212&\" \n(n=\"&numbers!B$17&\" Patients)\"","v":"Diabetes Therapy \n(n=47 Patients)"},{"$f":"$A212&\" \n(n=\"&numbers!C$17&\" Patients)\"","v":"Diabetes Therapy \n(n=55 Patients)"},{"$f":"$A212&\" \n(n=\"&numbers!D$17&\" Patients)\"","v":"Diabetes Therapy \n(n=67 Patients)"},{"$f":"$A212&\" \n(n=\"&numbers!E$17&\" Patients)\"","v":"Diabetes Therapy \n(n=98 Patients)"}]
[{"$f":"A85","v":"Antiplatelet Therapy"},{"$f":"$A213&\" (n=\"&numbers!B$17&\" Patients)\"","v":"Antiplatelet Therapy (n=47 Patients)"},{"$f":"$A213&\" (n=\"&numbers!C$17&\" Patients)\"","v":"Antiplatelet Therapy (n=55 Patients)"},{"$f":"$A213&\" (n=\"&numbers!D$17&\" Patients)\"","v":"Antiplatelet Therapy (n=67 Patients)"},{"$f":"$A213&\" (n=\"&numbers!E$17&\" Patients)\"","v":"Antiplatelet Therapy (n=98 Patients)"}]
[{"$f":"A90","v":"ACE Inhibitor (or ARB) Use"},{"$f":"$A214&\" \n(n=\"&numbers!B$17&\" Patients)\"","v":"ACE Inhibitor (or ARB) Use \n(n=47 Patients)"},{"$f":"$A214&\" \n(n=\"&numbers!C$17&\" Patients)\"","v":"ACE Inhibitor (or ARB) Use \n(n=55 Patients)"},{"$f":"$A214&\" \n(n=\"&numbers!D$17&\" Patients)\"","v":"ACE Inhibitor (or ARB) Use \n(n=67 Patients)"},{"$f":"$A214&\" \n(n=\"&numbers!E$17&\" Patients)\"","v":"ACE Inhibitor (or ARB) Use \n(n=98 Patients)"}]
[{"$f":"A94","v":"Lipid-Lowering Agent Use"},{"$f":"$A215&\" (n=\"&numbers!B$17&\" Patients)\"","v":"Lipid-Lowering Agent Use (n=47 Patients)"},{"$f":"$A215&\" (n=\"&numbers!C$17&\" Patients)\"","v":"Lipid-Lowering Agent Use (n=55 Patients)"},{"$f":"$A215&\" (n=\"&numbers!D$17&\" Patients)\"","v":"Lipid-Lowering Agent Use (n=67 Patients)"},{"$f":"$A215&\" (n=\"&numbers!E$17&\" Patients)\"","v":"Lipid-Lowering Agent Use (n=98 Patients)"}]
["Type of Lipid-Lowering Agent",{"$f":"$A216","v":"Type of Lipid-Lowering Agent"},{"$f":"$A216","v":"Type of Lipid-Lowering Agent"},{"$f":"$A216","v":"Type of Lipid-Lowering Agent"},{"$f":"$A216","v":"Type of Lipid-Lowering Agent"}]
[{"$f":"A102","v":"Yearly Foot, Eye, and Dental Exams"},{"$f":"$A217&\" \n(n=\"&numbers!B$17&\" Patients)\"","v":"Yearly Foot, Eye, and Dental Exams \n(n=47 Patients)"},{"$f":"$A217&\" \n(n=\"&numbers!C$17&\" Patients)\"","v":"Yearly Foot, Eye, and Dental Exams \n(n=55 Patients)"},{"$f":"$A217&\" \n(n=\"&numbers!D$17&\" Patients)\"","v":"Yearly Foot, Eye, and Dental Exams \n(n=67 Patients)"},{"$f":"$A217&\" \n(n=\"&numbers!E$17&\" Patients)\"","v":"Yearly Foot, Eye, and Dental Exams \n(n=98 Patients)"}]
[{"$f":"A107","v":"Immunizations"},{"$f":"$A218&\" (n=\"&numbers!B$17&\" Patients)\"","v":"Immunizations (n=47 Patients)"},{"$f":"$A218&\" \n(n=\"&numbers!C$17&\" Patients)\"","v":"Immunizations \n(n=55 Patients)"},{"$f":"$A218&\" \n(n=\"&numbers!D$17&\" Patients)\"","v":"Immunizations \n(n=67 Patients)"},{"$f":"$A218&\" \n(n=\"&numbers!E$17&\" Patients)\"","v":"Immunizations \n(n=98 Patients)"}]
[{"$f":"A114","v":"Urine Protein Testing during Audit Period"},{"$f":"$A219&\" \n(n=\"&numbers!B$17&\" Patients)\"","v":"Urine Protein Testing during Audit Period \n(n=47 Patients)"},{"$f":"$A219&\" \n(n=\"&numbers!C$17&\" Patients)\"","v":"Urine Protein Testing during Audit Period \n(n=55 Patients)"},{"$f":"$A219&\" \n(n=\"&numbers!D$17&\" Patients)\"","v":"Urine Protein Testing during Audit Period \n(n=67 Patients)"},{"$f":"$A219&\" \n(n=\"&numbers!E$17&\" Patients)\"","v":"Urine Protein Testing during Audit Period \n(n=98 Patients)"}]
[{"$f":"A119","v":"Type of urine protein testing"},{"$f":"$A220&\" (n=\"&(ROUND((B$17*B115/100),0))&\" Patients)\"","v":"Type of urine protein testing (n=31 Patients)"},{"$f":"$A220&\" (n=\"&(ROUND((C$17*C115/100),0))&\" Patients)\"","v":"Type of urine protein testing (n=12 Patients)"},{"$f":"$A220&\" (n=\"&(ROUND((D$17*D115/100),0))&\" Patients)\"","v":"Type of urine protein testing (n=15 Patients)"},{"$f":"$A220&\" (n=\"&(ROUND((E$17*E115/100),0))&\" Patients)\"","v":"Type of urine protein testing (n=22 Patients)"}]
[{"$f":"A127","v":"Results for patients tested with an A:C ratio or with 1+ protein or more on UA dipstick"},{"$f":"$A$221","v":"Results for patients tested with an A:C ratio or with 1+ protein or more on UA dipstick"},{"$f":"A221","v":"Results for patients tested with an A:C ratio or with 1+ protein or more on UA dipstick"},{"$f":"A221","v":"Results for patients tested with an A:C ratio or with 1+ protein or more on UA dipstick"},{"$f":"A221","v":"Results for patients tested with an A:C ratio or with 1+ protein or more on UA dipstick"}]
[{"$f":"A132","v":"Blood Creatinine Obtained in Past 12 Months"},{"$f":"$A222&\" (n=\"&numbers!B$17&\" Patients)\"","v":"Blood Creatinine Obtained in Past 12 Months (n=47 Patients)"},{"$f":"$A222&\" (n=\"&numbers!C$17&\" Patients)\"","v":"Blood Creatinine Obtained in Past 12 Months (n=55 Patients)"},{"$f":"$A222&\" (n=\"&numbers!D$17&\" Patients)\"","v":"Blood Creatinine Obtained in Past 12 Months (n=67 Patients)"},{"$f":"$A222&\" (n=\"&numbers!E$17&\" Patients)\"","v":"Blood Creatinine Obtained in Past 12 Months (n=98 Patients)"}]
[{"$f":"A137","v":"Estimated GFR Documented during Audit Period"},{"$f":"$A223&\" \n(n=\"&numbers!B$17&\" Patients)\"","v":"Estimated GFR Documented during Audit Period \n(n=47 Patients)"},{"$f":"$A223&\" \n(n=\"&numbers!C$17&\" Patients)\"","v":"Estimated GFR Documented during Audit Period \n(n=55 Patients)"},{"$f":"$A223&\" \n(n=\"&numbers!D$17&\" Patients)\"","v":"Estimated GFR Documented during Audit Period \n(n=67 Patients)"},{"$f":"$A223&\" \n(n=\"&numbers!E$17&\" Patients)\"","v":"Estimated GFR Documented during Audit Period \n(n=98 Patients)"}]
["Total Cholesterol in Past 12 Months",{"$f":"$A224&\" \n(n=\"&numbers!B$17&\" Patients)\"","v":"Total Cholesterol in Past 12 Months \n(n=47 Patients)"},{"$f":"$A224&\" (n=\"&numbers!C$17&\" Patients)\"","v":"Total Cholesterol in Past 12 Months (n=55 Patients)"},{"$f":"$A224&\" (n=\"&numbers!D$17&\" Patients)\"","v":"Total Cholesterol in Past 12 Months (n=67 Patients)"},{"$f":"$A224&\" (n=\"&numbers!E$17&\" Patients)\"","v":"Total Cholesterol in Past 12 Months (n=98 Patients)"}]
["HDL Cholesterol in Past 12 Months",{"$f":"$A225&\" \n(n=\"&numbers!B$17&\" Patients)\"","v":"HDL Cholesterol in Past 12 Months \n(n=47 Patients)"},{"$f":"$A225&\" (n=\"&numbers!C$17&\" Patients)\"","v":"HDL Cholesterol in Past 12 Months (n=55 Patients)"},{"$f":"$A225&\" (n=\"&numbers!D$17&\" Patients)\"","v":"HDL Cholesterol in Past 12 Months (n=67 Patients)"},{"$f":"$A225&\" (n=\"&numbers!E$17&\" Patients)\"","v":"HDL Cholesterol in Past 12 Months (n=98 Patients)"}]
["LDL Cholesterol in Past 12 Months",{"$f":"$A226&\" (n=\"&numbers!B$17&\" Patients)\"","v":"LDL Cholesterol in Past 12 Months (n=47 Patients)"},{"$f":"$A226&\" (n=\"&numbers!C$17&\" Patients)\"","v":"LDL Cholesterol in Past 12 Months (n=55 Patients)"},{"$f":"$A226&\" (n=\"&numbers!D$17&\" Patients)\"","v":"LDL Cholesterol in Past 12 Months (n=67 Patients)"},{"$f":"$A226&\" (n=\"&numbers!E$17&\" Patients)\"","v":"LDL Cholesterol in Past 12 Months (n=98 Patients)"}]
["Triglycerides in Past 12 Months",{"$f":"$A227&\" \n(n=\"&numbers!B$17&\" Patients)\"","v":"Triglycerides in Past 12 Months \n(n=47 Patients)"},{"$f":"$A227&\" \n(n=\"&numbers!C$17&\" Patients)\"","v":"Triglycerides in Past 12 Months \n(n=55 Patients)"},{"$f":"$A227&\" \n(n=\"&numbers!D$17&\" Patients)\"","v":"Triglycerides in Past 12 Months \n(n=67 Patients)"},{"$f":"$A227&\" \n(n=\"&numbers!E$17&\" Patients)\"","v":"Triglycerides in Past 12 Months \n(n=98 Patients)"}]
[{"$f":"A166","v":"EKG (age 30 and above)"},{"$f":"$A228","v":"EKG (age 30 and above)"},{"$f":"A228","v":"EKG (age 30 and above)"},{"$f":"A228","v":"EKG (age 30 and above)"},{"$f":"A228","v":"EKG (age 30 and above)"}]
[{"$f":"A171","v":"Tuberculosis Status"},{"$f":"$A229&\" \n(n=\"&numbers!B$17&\" Patients)\"","v":"Tuberculosis Status \n(n=47 Patients)"},{"$f":"$A229&\" \n(n=\"&numbers!C$17&\" Patients)\"","v":"Tuberculosis Status \n(n=55 Patients)"},{"$f":"$A229&\" \n(n=\"&numbers!D$17&\" Patients)\"","v":"Tuberculosis Status \n(n=67 Patients)"},{"$f":"$A229&\" \n(n=\"&numbers!E$17&\" Patients)\"","v":"Tuberculosis Status \n(n=98 Patients)"}]
[{"$f":"A180","v":"Diabetes-Related Education (Yearly)"},{"$f":"$A230&\" \n(n=\"&numbers!B$17&\" Patients)\"","v":"Diabetes-Related Education (Yearly) \n(n=47 Patients)"},{"$f":"$A230&\" \n(n=\"&numbers!C$17&\" Patients)\"","v":"Diabetes-Related Education (Yearly) \n(n=55 Patients)"},{"$f":"$A230&\" \n(n=\"&numbers!D$17&\" Patients)\"","v":"Diabetes-Related Education (Yearly) \n(n=67 Patients)"},{"$f":"$A230&\" \n(n=\"&numbers!E$17&\" Patients)\"","v":"Diabetes-Related Education (Yearly) \n(n=98 Patients)"}]
[{"$f":"A187","v":"Depression Identified as Active Diagnosis"},{"$f":"$A231&\" \n(n=\"&numbers!B$17&\" Patients)\"","v":"Depression Identified as Active Diagnosis \n(n=47 Patients)"},{"$f":"$A231&\" \n(n=\"&numbers!C$17&\" Patients)\"","v":"Depression Identified as Active Diagnosis \n(n=55 Patients)"},{"$f":"$A231&\" \n(n=\"&numbers!D$17&\" Patients)\"","v":"Depression Identified as Active Diagnosis \n(n=67 Patients)"},{"$f":"$A231&\" \n(n=\"&numbers!E$17&\" Patients)\"","v":"Depression Identified as Active Diagnosis \n(n=98 Patients)"}]
[{"$f":"A191","v":"Of the Patients without Active Depression Diagnosis, Proportion Screened for Depression in Past Year"},{"$f":"$A232&\" (n=\"&(ROUND((B$17*B189/100),0))&\" Patients)\"","v":"Of the Patients without Active Depression Diagnosis, Proportion Screened for Depression in Past Year (n=46 Patients)"},{"$f":"$A232&\" (n=\"&(ROUND((C$17*C189/100),0))&\" Patients)\"","v":"Of the Patients without Active Depression Diagnosis, Proportion Screened for Depression in Past Year (n=52 Patients)"},{"$f":"$A232&\" (n=\"&(ROUND((D$17*D189/100),0))&\" Patients)\"","v":"Of the Patients without Active Depression Diagnosis, Proportion Screened for Depression in Past Year (n=61 Patients)"},{"$f":"$A232&\" (n=\"&(ROUND((E$17*E189/100),0))&\" Patients)\"","v":"Of the Patients without Active Depression Diagnosis, Proportion Screened for Depression in Past Year (n=86 Patients)"}]

{"sheet":"audit1","index":1,"n_rows":429,"n_cols":2,"rows_kept":429,"cut":false,"hidden":false,"merged":[[0,0,0,1],[1,0,1,1],[6,0,6,1],[4,0,4,1]]}
[{"$f":"numbers!A2","v":"Health Status of Patients with Diabetes"}]
[{"$f":"numbers!B15","v":"IHS Demo Site"}]
["This information is for the following time period:",{"$f":"numbers!B16","v":"1/1/2005-12/31/2005"}]
["Number of patients included in this report (denominator):",{"$f":"numbers!B17","v":47}]
[{"$f":"IF(ISBLANK(numbers!B18),\"\",numbers!B18)","v":"Active patients on the IHS Diabetes Register"}]
[]
["  Diabetes is a disease that is disproportionately affecting the American Indian and Alaska Native communities. Armed with the right information we can work together to fight and eventually prevent this disease. First, we need to know the true facts about diabetes in each tribe and community. \n  This information is based on your clinic's tracking of diabetes in your community for a one year time frame. It is based on information tracked in the Resource Patient Management System (RPMS) or compiled in an annual chart review. By looking at this information we can best target health resources, support those in the community with diabetes and prevent diabetes in future generations.\n  Much of the narrative information found in this report is taken from the 2006 Indian Health Service Standards of Care for Adults with Type 2 Diabetes."]
[]
[]
[]
[]
[]
[]
[]
[]
[]
[]
[]
[]
[]
[]
[]
[]
[]
[]
[]
[]
[]
[]
[]
[]
[]
[]
[]
[]
[]
[]
[]
[]
[]
[]
[]
[]
[]
[]
[]
[]
[]
[]
[]
[]
[]
[]
[]
[]
[]
[]
[]
[]
[]
[]
[]
[]
[]
[]
[]
[]
[]
[]
[]
[]
[]
[]
[]
[]
[]
[]
[]
[]
[]
[]
[]
[]
[]
[]
[]
[]
[]
[]
[]
[]
[]
[]
[]
[]
[]
[]
[]
[]
[]
[]
[]
[]
[]
[]
[]
[]
[]
[]
[]
[]
[]
[]
[]
[]
[]
[]
[]
[]
[]
[]
[]
[]
[]
[]
[]
[]
[]
[]
[]
[]
[]
[]
[]
[]
[]
[]
[]
[]
[]
[]
[]
[]
[]
[]
[]
[]
[]
[]
[]
[]
[]
[]
[]
[]
[]
[]
[]
[]
[]
[]
[]
[]
[]
[]
[]
[]
[]
[]
[]
[]
[]
[]
[]
[]
[]
[]
[]
[]
[]
[]
[]
[]
[]
[]
[]
[]
[]
[]
[]
[]
[]
[]
[]
[]
[]
[]
[]
[]
[]
[]
[]
[]
[]
[]
[]
[]
[]
[]
[]
[]
[]
[]
[]
[]
[]
[]
[]
[]
[]
[]
[]
[]
[]
[]
[]
[]
[]
[]
[]
[]
[]
[]
[]
[]
[]
[]
[]
[]
[]
[]
[]
[]
[]
[]
[]
[]
[]
[]
[]
[]
[]
[]
[]
[]
[]
[]
[]
[]
[]
[]
[]
[]
[]
[]
[]
[]
[]
[]
[]
[]
[]
[]
[]
[]
[]
[]
[]
[]
[]
[]
[]
[]
[]
[]
[]
[]
[]
[]
[]
[]
[]
[]
[]
[]
[]
[]
[]
[]
[]
[]
[]
[]
[]
[]
[]
[]
[]
[]
[]
[]
[]
[]
[]
[]
[]
[]
[]
[]
[]
[]
[]
[]
[]
[]
[]
[]
[]
[]
[]
[]
[]
[]
[]
[]
[]
[]
[]
[]
[]
[]
[]
[]
[]
[]
[]
[]
[]
[]
[]
[]
[]
[]
[]
[]
[]
[]
[]
[]
[]
[]
[]
[]
[]
[]
[]
[]
[]
[]
[]
[]
[]
[]
[]
[]
[]
[]
[]
[]
[]
[]
[]
[]
[]
[]
[]
[]
[]
[]
[]
[]
[]
[]
[]
[]
[]
[]
[]
[]
[]
[]
[]
[]
[]
[]
[]
[]
[]
[]
[]
[]
[]
[]
[]
[]
[]
[]
[]
[]
[]
[]
[]
[]
[]
[]
[]
[]
[]
[null," "]

{"sheet":"audit2","index":2,"n_rows":429,"n_cols":2,"rows_kept":429,"cut":false,"hidden":false,"merged":[[0,0,0,1],[1,0,1,1],[4,0,4,1],[6,0,6,1]]}
[{"$f":"numbers!A2","v":"Health Status of Patients with Diabetes"}]
[{"$f":"numbers!C15","v":"IHS Demo Site"}]
["This information is for the following time period:",{"$f":"numbers!C16","v":"1/1/2006-12/31/2006"}]
["Number of patients included in this report (denominator):",{"$f":"numbers!C17","v":55}]
[{"$f":"IF(ISBLANK(numbers!C18),\"\",numbers!C18)","v":"Active patients on the IHS Diabetes Register"}]
[]
["  Diabetes is a disease that is disproportionately affecting the American Indian and Alaska Native communities. Armed with the right information we can work together to fight and eventually prevent this disease. First, we need to know the true facts about diabetes in each tribe and community. \n  This information is based on your clinic's tracking of diabetes in your community for a one year time frame. It is based on information tracked in the Resource Patient Management System (RPMS) or compiled in an annual chart review. By looking at this information we can best target health resources, support those in the community with diabetes and prevent diabetes in future generations.\n  Much of the narrative information found in this report is taken from the 2006 Indian Health Service Standards of Care for Adults with Type 2 Diabetes."]
[]
[]
[]
[]
[]
[]
[]
[]
[]
[]
[]
[]
[]
[]
[]
[]
[]
[]
[]
[]
[]
[]
[]
[]
[]
[]
[]
[]
[]
[]
[]
[]
[]
[]
[]
[]
[]
[]
[]
[]
[]
[]
[]
[]
[]
[]
[]
[]
[]
[]
[]
[]
[]
[]
[]
[]
[]
[]
[]
[]
[]
[]
[]
[]
[]
[]
[]
[]
[]
[]
[]
[]
[]
[]
[]
[]
[]
[]
[]
[]
[]
[]
[]
[]
[]
[]
[]
[]
[]
[]
[]
[]
[]
[]
[]
[]
[]
[]
[]
[]
[]
[]
[]
[]
[]
[]
[]
[]
[]
[]
[]
[]
[]
[]
[]
[]
[]
[]
[]
[]
[]
[]
[]
[]
[]
[]
[]
[]
[]
[]
[]
[]
[]
[]
[]
[]
[]
[]
[]
[]
[]
[]
[]
[]
[]
[]
[]
[]
[]
[]
[]
[]
[]
[]
[]
[]
[]
[]
[]
[]
[]
[]
[]
[]
[]
[]
[]
[]
[]
[]
[]
[]
[]
[]
[]
[]
[]
[]
[]
[]
[]
[]
[]
[]
[]
[]
[]
[]
[]
[]
[]
[]
[]
[]
[]
[]
[]
[]
[]
[]
[]
[]
[]
[]
[]
[]
[]
[]
[]
[]
[]
[]
[]
[]
[]
[]
[]
[]
[]
[]
[]
[]
[]
[]
[]
[]
[]
[]
[]
[]
[]
[]
[]
[]
[]
[]
[]
[]
[]
[]
[]
[]
[]
[]
[]
[]
[]
[]
[]
[]
[]
[]
[]
[]
[]
[]
[]
[]
[]
[]
[]
[]
[]
[]
[]
[]
[]
[]
[]
[]
[]
[]
[]
[]
[]
[]
[]
[]
[]
[]
[]
[]
[]
[]
[]
[]
[]
[]
[]
[]
[]
[]
[]
[]
[]
[]
[]
[]
[]
[]
[]
[]
[]
[]
[]
[]
[]
[]
[]
[]
[]
[]
[]
[]
[]
[]
[]
[]
[]
[]
[]
[]
[]
[]
[]
[]
[]
[]
[]
[]
[]
[]
[]
[]
[]
[]
[]
[]
[]
[]
[]
[]
[]
[]
[]
[]
[]
[]
[]
[]
[]
[]
[]
[]
[]
[]
[]
[]
[]
[]
[]
[]
[]
[]
[]
[]
[]
[]
[]
[]
[]
[]
[]
[]
[]
[]
[]
[]
[]
[]
[]
[]
[]
[]
[]
[]
[]
[]
[]
[]
[]
[]
[]
[]
[]
[]
[]
[]
[]
[]
[]
[]
[]
[]
[]
[]
[]
[]
[]
[]
[]
[]
[]
[]
[]
[]
[]
[]
[]
[]
[]
[null," "]

{"sheet":"audit3","index":3,"n_rows":429,"n_cols":2,"rows_kept":429,"cut":false,"hidden":false,"merged":[[0,0,0,1],[1,0,1,1],[4,0,4,1],[6,0,6,1]]}
[{"$f":"numbers!A2","v":"Health Status of Patients with Diabetes"}]
[{"$f":"numbers!D15","v":"IHS Demo Site"}]
["This information is for the following time period:",{"$f":"numbers!D16","v":"1/1/2007-12/31/2007"}]
["Number of patients included in this report (denominator):",{"$f":"numbers!D17","v":67}]
[{"$f":"IF(ISBLANK(numbers!D18),\"\",numbers!D18)","v":"Active patients on the IHS Diabetes Register"}]
[]
["  Diabetes is a disease that is disproportionately affecting the American Indian and Alaska Native communities. Armed with the right information we can work together to fight and eventually prevent this disease. First, we need to know the true facts about diabetes in each tribe and community. \n  This information is based on your clinic's tracking of diabetes in your community for a one year time frame. It is based on information tracked in the Resource Patient Management System (RPMS) or compiled in an annual chart review. By looking at this information we can best target health resources, support those in the community with diabetes and prevent diabetes in future generations.\n  Much of the narrative information found in this report is taken from the 2006 Indian Health Service Standards of Care for Adults with Type 2 Diabetes."]
[]
[]
[]
[]
[]
[]
[]
[]
[]
[]
[]
[]
[]
[]
[]
[]
[]
[]
[]
[]
[]
[]
[]
[]
[]
[]
[]
[]
[]
[]
[]
[]
[]
[]
[]
[]
[]
[]
[]
[]
[]
[]
[]
[]
[]
[]
[]
[]
[]
[]
[]
[]
[]
[]
[]
[]
[]
[]
[]
[]
[]
[]
[]
[]
[]
[]
[]
[]
[]
[]
[]
[]
[]
[]
[]
[]
[]
[]
[]
[]
[]
[]
[]
[]
[]
[]
[]
[]
[]
[]
[]
[]
[]
[]
[]
[]
[]
[]
[]
[]
[]
[]
[]
[]
[]
[]
[]
[]
[]
[]
[]
[]
[]
[]
[]
[]
[]
[]
[]
[]
[]
[]
[]
[]
[]
[]
[]
[]
[]
[]
[]
[]
[]
[]
[]
[]
[]
[]
[]
[]
[]
[]
[]
[]
[]
[]
[]
[]
[]
[]
[]
[]
[]
[]
[]
[]
[]
[]
[]
[]
[]
[]
[]
[]
[]
[]
[]
[]
[]
[]
[]
[]
[]
[]
[]
[]
[]
[]
[]
[]
[]
[]
[]
[]
[]
[]
[]
[]
[]
[]
[]
[]
[]
[]
[]
[]
[]
[]
[]
[]
[]
[]
[]
[]
[]
[]
[]
[]
[]
[]
[]
[]
[]
[]
[]
[]
[]
[]
[]
[]
[]
[]
[]
[]
[]
[]
[]
[]
[]
[]
[]
[]
[]
[]
[]
[]
[]
[]
[]
[]
[]
[]
[]
[]
[]
[]
[]
[]
[]
[]
[]
[]
[]
[]
[]
[]
[]
[]
[]
[]
[]
[]
[]
[]
[]
[]
[]
[]
[]
[]
[]
[]
[]
[]
[]
[]
[]
[]
[]
[]
[]
[]
[]
[]
[]
[]
[]
[]
[]
[]
[]
[]
[]
[]
[]
[]
[]
[]
[]
[]
[]
[]
[]
[]
[]
[]
[]
[]
[]
[]
[]
[]
[]
[]
[]
[]
[]
[]
[]
[]
[]
[]
[]
[]
[]
[]
[]
[]
[]
[]
[]
[]
[]
[]
[]
[]
[]
[]
[]
[]
[]
[]
[]
[]
[]
[]
[]
[]
[]
[]
[]
[]
[]
[]
[]
[]
[]
[]
[]
[]
[]
[]
[]
[]
[]
[]
[]
[]
[]
[]
[]
[]
[]
[]
[]
[]
[]
[]
[]
[]
[]
[]
[]
[]
[]
[]
[]
[]
[]
[]
[]
[]
[]
[]
[]
[]
[]
[]
[]
[]
[]
[]
[]
[]
[]
[]
[]
[]
[]
[]
[]
[]
[]
[]
[]
[]
[]
[]
[]
[]
[]
[null," "]

{"sheet":"audit4","index":4,"n_rows":429,"n_cols":2,"rows_kept":429,"cut":false,"hidden":false,"merged":[[0,0,0,1],[1,0,1,1],[4,0,4,1],[6,0,6,1]]}
[{"$f":"numbers!A2","v":"Health Status of Patients with Diabetes"}]
[{"$f":"numbers!E15","v":"IHS Demo Site"}]
["This information is for the following time period:",{"$f":"numbers!E16","v":"1/1/2008-12/31/2008"}]
["Number of patients included in this report (denominator):",{"$f":"numbers!E17","v":98}]
[{"$f":"IF(ISBLANK(numbers!E18),\"\",numbers!E18)","v":"Active patients on the IHS Diabetes Register"}]
[]
["  Diabetes is a disease that is disproportionately affecting the American Indian and Alaska Native communities. Armed with the right information we can work together to fight and eventually prevent this disease. First, we need to know the true facts about diabetes in each tribe and community. \n  This information is based on your clinic's tracking of diabetes in your community for a one year time frame. It is based on information tracked in the Resource Patient Management System (RPMS) or compiled in an annual chart review. By looking at this information we can best target health resources, support those in the community with diabetes and prevent diabetes in future generations.\n  Much of the narrative information found in this report is taken from the 2006 Indian Health Service Standards of Care for Adults with Type 2 Diabetes."]
[]
[]
[]
[]
[]
[]
[]
[]
[]
[]
[]
[]
[]
[]
[]
[]
[]
[]
[]
[]
[]
[]
[]
[]
[]
[]
[]
[]
[]
[]
[]
[]
[]
[]
[]
[]
[]
[]
[]
[]
[]
[]
[]
[]
[]
[]
[]
[]
[]
[]
[]
[]
[]
[]
[]
[]
[]
[]
[]
[]
[]
[]
[]
[]
[]
[]
[]
[]
[]
[]
[]
[]
[]
[]
[]
[]
[]
[]
[]
[]
[]
[]
[]
[]
[]
[]
[]
[]
[]
[]
[]
[]
[]
[]
[]
[]
[]
[]
[]
[]
[]
[]
[]
[]
[]
[]
[]
[]
[]
[]
[]
[]
[]
[]
[]
[]
[]
[]
[]
[]
[]
[]
[]
[]
[]
[]
[]
[]
[]
[]
[]
[]
[]
[]
[]
[]
[]
[]
[]
[]
[]
[]
[]
[]
[]
[]
[]
[]
[]
[]
[]
[]
[]
[]
[]
[]
[]
[]
[]
[]
[]
[]
[]
[]
[]
[]
[]
[]
[]
[]
[]
[]
[]
[]
[]
[]
[]
[]
[]
[]
[]
[]
[]
[]
[]
[]
[]
[]
[]
[]
[]
[]
[]
[]
[]
[]
[]
[]
[]
[]
[]
[]
[]
[]
[]
[]
[]
[]
[]
[]
[]
[]
[]
[]
[]
[]
[]
[]
[]
[]
[]
[]
[]
[]
[]
[]
[]
[]
[]
[]
[]
[]
[]
[]
[]
[]
[]
[]
[]
[]
[]
[]
[]
[]
[]
[]
[]
[]
[]
[]
[]
[]
[]
[]
[]
[]
[]
[]
[]
[]
[]
[]
[]
[]
[]
[]
[]
[]
[]
[]
[]
[]
[]
[]
[]
[]
[]
[]
[]
[]
[]
[]
[]
[]
[]
[]
[]
[]
[]
[]
[]
[]
[]
[]
[]
[]
[]
[]
[]
[]
[]
[]
[]
[]
[]
[]
[]
[]
[]
[]
[]
[]
[]
[]
[]
[]
[]
[]
[]
[]
[]
[]
[]
[]
[]
[]
[]
[]
[]
[]
[]
[]
[]
[]
[]
[]
[]
[]
[]
[]
[]
[]
[]
[]
[]
[]
[]
[]
[]
[]
[]
[]
[]
[]
[]
[]
[]
[]
[]
[]
[]
[]
[]
[]
[]
[]
[]
[]
[]
[]
[]
[]
[]
[]
[]
[]
[]
[]
[]
[]
[]
[]
[]
[]
[]
[]
[]
[]
[]
[]
[]
[]
[]
[]
[]
[]
[]
[]
[]
[]
[]
[]
[]
[]
[]
[]
[]
[]
[]
[]
[]
[]
[]
[]
[]
[]
[]
[]
[]
[]
[]
[null," "]

{"sheet":"comparisons","index":5,"n_rows":7,"n_cols":8,"rows_kept":7,"cut":false,"hidden":false,"merged":[[2,0,2,7],[0,0,0,7],[1,0,1,7],[6,0,6,7]]}
["Diabetes Data Report - Comparison"]
[{"$f":"numbers!B16","v":"1/1/2005-12/31/2005"}]
["This information is for the following groups:"]
["Name",{"$f":"numbers!B15","v":"IHS Demo Site"},null,{"$f":"numbers!C15","v":"IHS Demo Site"},null,{"$f":"numbers!D15","v":"IHS Demo Site"},null,{"$f":"numbers!E15","v":"IHS Demo Site"}]
["Denominator",{"$f":"numbers!B17","v":47},null,{"$f":"numbers!C17","v":55},null,{"$f":"numbers!D17","v":67},null,{"$f":"numbers!E17","v":98}]
[null,{"$f":"IF(ISBLANK(numbers!B18),\" \",numbers!B18)","v":"Active patients on the IHS Diabetes Register"},null,{"$f":"IF(ISBLANK(numbers!C18),\" \",numbers!C18)","v":"Active patients on the IHS Diabetes Register"},null,{"$f":"IF(ISBLANK(numbers!D18),\" \",numbers!D18)","v":"Active patients on the IHS Diabetes Register"},null,{"$f":"IF(ISBLANK(numbers!E18),\" \",numbers!E18)","v":"Active patients on the IHS Diabetes Register"}]
["The following report shows four different diabetes patient care audits. By viewing the diabetes-related information over time we can identify strengths in patient care and disease management. As you look at these graphs think about factors that may be contributing to the differences (example: starting new intervention programs, changes in standards of care, changes in staffing, etc.).This information can also assist your program in pinpointing areas needing additional attention."]

{"sheet":"trends","index":6,"n_rows":7,"n_cols":8,"rows_kept":7,"cut":false,"hidden":false,"merged":[[6,0,6,7],[2,0,2,7],[0,0,0,7],[1,0,1,7]]}
["Diabetes Data Report - Trends"]
[{"$f":"numbers!B15","v":"IHS Demo Site"}]
["This information is for the following time periods:"]
["Name",{"$f":"numbers!B16","v":"1/1/2005-12/31/2005"},null,{"$f":"numbers!C16","v":"1/1/2006-12/31/2006"},null,{"$f":"numbers!D16","v":"1/1/2007-12/31/2007"},null,{"$f":"numbers!E16","v":"1/1/2008-12/31/2008"}]
["Denominator",{"$f":"numbers!B17","v":47},null,{"$f":"numbers!C17","v":55},null,{"$f":"numbers!D17","v":67},null,{"$f":"numbers!E17","v":98}]
[null,{"$f":"IF(ISBLANK(numbers!B18),\" \",numbers!B18)","v":"Active patients on the IHS Diabetes Register"},null,{"$f":"IF(ISBLANK(numbers!C18),\" \",numbers!C18)","v":"Active patients on the IHS Diabetes Register"},null,{"$f":"IF(ISBLANK(numbers!D18),\" \",numbers!D18)","v":"Active patients on the IHS Diabetes Register"},null,{"$f":"IF(ISBLANK(numbers!E18),\" \",numbers!E18)","v":"Active patients on the IHS Diabetes Register"}]
["The following report tracks diabetes over four time periods. By viewing the diabetes-related information over time we can track improvements in patient care and disease management. As you look at these graphs think about factors that may be contributing to the changes over time (example: starting new intervention programs, changes in standards of care, changes in staffing, etc.). This information can also assist your program in pinpointing areas needing additional attention."]